doc: Add a link to the package on Flathub.

8 jobs for master in 5 minutes and 10 seconds (queued for 3 seconds)
Status Job ID Name Coverage
  Lint
failed #29874
allowed to fail
mypyc

00:00:44

failed #29872
allowed to fail
pylint-latest

00:03:21

passed #29873
pylint-plugins

00:02:11

passed #29871
security-check

00:00:46

 
  Test
passed #29875
pytest-3.7

00:00:52

passed #29876
pytest-latest

00:01:24

 
  Build
failed #29877
www
build-doc

00:00:22

passed #29878
build-ubuntu

00:00:19

 
Name Stage Failure
failed
mypyc Lint
poezio/plugin_e2ee.py:243: error: Argument 2 to "set_and_save" of "Config" has incompatible type "Optional[str]"; expected "Union[str, int, float, bool]"
poezio/plugin_e2ee.py:270: error: Argument 2 to "isinstance" has incompatible type "Tuple[Union[MucTab, DynamicConversationTab, StaticConversationTab, PrivateTab]]"; expected "Union[type, Tuple[Union[type, Tuple[Any, ...]], ...]]"
poezio/plugin_e2ee.py:329: error: Unexpected keyword argument "passthrough" for "_encrypt" of "E2EEPlugin"
poezio/plugin_e2ee.py:374: error: Item "MucTab" of "Union[MucTab, DynamicConversationTab, StaticConversationTab, PrivateTab]" has no attribute "parent_muc"
poezio/plugin_e2ee.py:374: error: Item "DynamicConversationTab" of "Union[MucTab, DynamicConversationTab, StaticConversationTab, PrivateTab]" has no attribute "parent_muc"
poezio/plugin_e2ee.py:374: error: Item "StaticConversationTab" of "Union[MucTab, DynamicConversationTab, StaticConversationTab, PrivateTab]" has no attribute "parent_muc"
poezio/plugin_e2ee.py:389: note: "_encrypt" of "E2EEPlugin" defined here
poezio/plugin_e2ee.py:499: error: Incompatible return value type (got "Union[str, int, float, bool]", expected "str")
ERROR: Job failed: exit code 1
failed
pylint-latest Lint
poezio/multiuserchat.py:32:4: E0611: No name 'Core' in module 'poezio.core' (no-name-in-module)
************* Module poezio.common
poezio/common.py:505:15: E1101: Module 'time' has no 'replace' member (no-member)
************* Module poezio.core.core
poezio/core/core.py:1097:8: E1102: self.tabs.next is not callable (not-callable)
poezio/core/core.py:1103:8: E1102: self.tabs.prev is not callable (not-callable)
************* Module poezio.core.tabs
poezio/core/tabs.py:297:12: E1102: self.prev is not callable (not-callable)
ERROR: Job failed: exit code 1
failed
build-doc Build
python3 setup.py build_ext --inplace

Setuptools was not found. Install setuptools for python 3.

make: *** [Makefile:6: all] Error 1
Error: exec session exited with non-zero exit code 1: OCI runtime error
Running after_script
Uploading artifacts for failed job
ERROR: Job failed: exit status 1