muc: remove non-deterministic nick colors

6 jobs for remote-nondeterministic-nick-colors in 3 minutes and 31 seconds (queued for 1 second)
Status Job ID Name Coverage
  Lint
failed #31582
allowed to fail
mypyc

00:00:33

failed #31580
allowed to fail
pylint-latest

00:02:38

failed #31581
allowed to fail
pylint-plugins

00:02:21

passed #31579
security-check

00:00:25

 
  Test
failed #31583
pytest-3.7

00:00:40

failed #31584
pytest-latest

00:00:51

 
Name Stage Failure
failed
pytest-3.7 Test
>       user1.change_color('blue', deterministic=False)
E TypeError: change_color() got an unexpected keyword argument 'deterministic'

test/test_user.py:43: TypeError
=========================== short test summary info ============================
FAILED test/test_user.py::test_change_color - TypeError: change_color() got a...
======================== 1 failed, 104 passed in 1.37s =========================
Cleaning up file based variables
ERROR: Job failed: exit code 1
failed
pylint-latest Lint
poezio/ui/types.py:104:23: E1136: Value 'Optional' is unsubscriptable (unsubscriptable-object)
poezio/ui/types.py:105:29: E1136: Value 'Optional' is unsubscriptable (unsubscriptable-object)
poezio/ui/types.py:108:23: E1136: Value 'Optional' is unsubscriptable (unsubscriptable-object)
poezio/ui/types.py:109:29: E1136: Value 'Optional' is unsubscriptable (unsubscriptable-object)
poezio/ui/types.py:110:22: E1136: Value 'Optional' is unsubscriptable (unsubscriptable-object)
poezio/ui/types.py:112:30: E1136: Value 'Optional' is unsubscriptable (unsubscriptable-object)
poezio/ui/types.py:114:22: E1136: Value 'Optional' is unsubscriptable (unsubscriptable-object)
Cleaning up file based variables
ERROR: Job failed: exit code 1
failed
pylint-plugins Lint
$ pylint -E plugins
************* Module plugins.upload
plugins/upload.py:53:40: E1136: Value 'Optional' is unsubscriptable (unsubscriptable-object)
************* Module plugins.lastlog
plugins/lastlog.py:27:18: E1136: Value 'Optional' is unsubscriptable (unsubscriptable-object)
************* Module plugins.untrackme
plugins/untrackme.py:17:11: E1136: Value 'Union' is unsubscriptable (unsubscriptable-object)
Cleaning up file based variables
ERROR: Job failed: exit code 1
failed
pytest-latest Test
>       user1.change_color('blue', deterministic=False)
E TypeError: change_color() got an unexpected keyword argument 'deterministic'

test/test_user.py:43: TypeError
=========================== short test summary info ============================
FAILED test/test_user.py::test_change_color - TypeError: change_color() got a...
======================== 1 failed, 104 passed in 1.41s =========================
Cleaning up file based variables
ERROR: Job failed: exit code 1
failed
mypyc Lint
poezio/plugin_e2ee.py:270: error: Argument 2 to "isinstance" has incompatible type "Tuple[Union[MucTab, DynamicConversationTab, StaticConversationTab, PrivateTab]]"; expected "Union[type, Tuple[Union[type, Tuple[Any, ...]], ...]]"
poezio/plugin_e2ee.py:329: error: Unexpected keyword argument "passthrough" for "_encrypt" of "E2EEPlugin"
poezio/plugin_e2ee.py:374: error: Item "MucTab" of "Union[MucTab, DynamicConversationTab, StaticConversationTab, PrivateTab]" has no attribute "parent_muc"
poezio/plugin_e2ee.py:374: error: Item "DynamicConversationTab" of "Union[MucTab, DynamicConversationTab, StaticConversationTab, PrivateTab]" has no attribute "parent_muc"
poezio/plugin_e2ee.py:374: error: Item "StaticConversationTab" of "Union[MucTab, DynamicConversationTab, StaticConversationTab, PrivateTab]" has no attribute "parent_muc"
poezio/plugin_e2ee.py:389: note: "_encrypt" of "E2EEPlugin" defined here
poezio/plugin_e2ee.py:499: error: Incompatible return value type (got "Union[str, int, float, bool]", expected "str")
Cleaning up file based variables
ERROR: Job failed: exit code 1