Changelog for -t feature

20 jobs for master in 17 minutes and 6 seconds (queued for 6 seconds)
Status Job ID Name Coverage
  Build
passed #30165
container
build:alpine

00:02:32

passed #30164
container
build:debian

00:02:55

passed #30163
container
build:fedora

00:01:57

passed #30166
freebsd
build:freebsd

00:09:47

passed #30167
container
build:no_botan

00:02:03

passed #30171
container
build:no_db

00:01:55

passed #30172
container
build:no_db_botan

00:01:56

passed #30169
container
build:no_libidn

00:02:19

passed #30170
container
build:no_sqlite3

00:02:40

passed #30168
container
build:no_udns

00:02:11

 
  Test
passed #30176
docker
test:alpine

00:02:17

passed #30181
docker
test:debian

00:01:48

failed #30182
docker
test:fedora

00:05:04

28.0%
passed #30177
freebsd
test:freebsd

00:02:03

passed #30175
docker
test:no_udns

00:02:26

failed #30173
docker
test:debian

00:20:01

failed #30174
docker
test:fedora

00:05:21

28.0%
 
  Packaging
skipped #30179
docker
packaging:archlinux
skipped #30178
docker
packaging:rpm
 
  Deploy
skipped #30180
www secure
deploy:doc:latest
 
Name Stage Failure
failed
test:fedora Test
make[3]: *** [CMakeFiles/coverage_e2e.dir/build.make:81: CMakeFiles/coverage_e2e] Error 1
make[2]: *** [CMakeFiles/Makefile2:714: CMakeFiles/coverage_e2e.dir/all] Error 2
make[1]: *** [CMakeFiles/Makefile2:721: CMakeFiles/coverage_e2e.dir/rule] Error 2
make: *** [Makefile:457: coverage_e2e] Error 2
Uploading artifacts for failed job
Uploading artifacts...
build/: found 1426 matching files and directories

Uploading artifacts as "archive" to coordinator... ok
id=30182 responseStatus=201 Created token=jCcTmkyF
ERROR: Job failed: exit code 1