Handle SASL failures by displaying a message and aborting the connection

14 jobs for 9.0-rc1 in 11 minutes and 5 seconds (queued for 11 seconds)
latest
Status Job ID Name Coverage
  Build
failed #29706
container
build:alpine

00:00:03

passed #29705
container
build:debian

00:04:31

passed #29704
container
build:fedora

00:04:18

passed #29707
container
build:no_botan

00:04:03

passed #29711
container
build:no_db

00:02:28

passed #29712
container
build:no_db_botan

00:02:07

passed #29709
container
build:no_libidn

00:02:29

passed #29710
container
build:no_sqlite3

00:03:05

passed #29708
container
build:no_udns

00:04:05

 
  Test
skipped #29716
docker
test:alpine
failed #29713
docker
test:debian

00:01:45

passed #29714
docker
test:fedora

00:05:44

84.3%
passed #29715
docker
test:no_udns

00:02:00

 
  Deploy
skipped #29717
www secure
deploy:doc:tag
 
Name Stage Failure
failed
test:debian Test
make[2]: *** [CMakeFiles/Makefile2:234: CMakeFiles/e2e.dir/all] Error 2
make[1]: *** [CMakeFiles/Makefile2:241: CMakeFiles/e2e.dir/rule] Error 2
make: *** [Makefile:229: e2e] Error 2
Running after_script
Uploading artifacts for failed job
Uploading artifacts...
build/: found 1056 matching files

Uploading artifacts to coordinator... ok
id=29713 responseStatus=201 Created token=n6GkveoD
ERROR: Job failed: exit code 1
failed
build:alpine Build There has been a runner system failure, please try again
Writing manifest to image destination
Storing signatures
b698e1267f9b53bbbf8b742a9d4aaa2304bdbc684edcbdb7eb77f64ccd2072be
ffb488e091c7e3874e2226bb70f17bfc7ff7beb3bc318971f5b174298ef3c346
Preparing environment
Error: executable file not found in $PATH: No such file or directory: OCI runtime command not found error
Uploading artifacts for failed job
Error: executable file not found in $PATH: No such file or directory: OCI runtime command not found error
ERROR: Job failed (system failure): unknown Custom executor executable exit code 127; executable execution terminated with: exit status 127