Simplify Rust imports.

5 jobs for rust in 6 minutes and 8 seconds (queued for 2 seconds)
latest
Status Job ID Name Coverage
  Test
passed #18987
allowed to fail
pylint-plugins

00:05:54

failed #18984
pytest-3.5

00:05:05

failed #18985
pytest-3.6

00:05:07

failed #18986
pytest-latest

00:05:26

passed #18983
security-check

00:00:31

 
Name Stage Failure
failed
pytest-latest Test
>       assert clean_text(example_string) == 'Toto titi Tata'
E AssertionError: assert 'Toto titi' == 'Toto titi Tata'
E - Toto titi
E + Toto titi Tata
E ? +++++

test/test_xhtml.py:22: AssertionError
================ 1 failed, 30 passed, 10 error in 0.80 seconds =================
ERROR: Job failed: exit code 1
failed
pytest-3.6 Test
>       assert clean_text(example_string) == 'Toto titi Tata'
E AssertionError: assert 'Toto titi' == 'Toto titi Tata'
E - Toto titi
E + Toto titi Tata
E ? +++++

test/test_xhtml.py:22: AssertionError
================ 1 failed, 30 passed, 10 error in 1.65 seconds =================
ERROR: Job failed: exit code 1
failed
pytest-3.5 Test
>       assert clean_text(example_string) == 'Toto titi Tata'
E AssertionError: assert 'Toto titi' == 'Toto titi Tata'
E - Toto titi
E + Toto titi Tata
E ? +++++

test/test_xhtml.py:22: AssertionError
================ 1 failed, 30 passed, 10 error in 1.71 seconds =================
ERROR: Job failed: exit code 1